Reaction Details
TargetStromelysin-1
LigandBDBM50291705
Substrate/Competitorn/a
Meas. Tech.ChEMBL_104744 (CHEMBL710744)
Ki 3.3±n/a nM
Citation Sawa, MTsukamoto, TKiyoi, TKurokawa, KNakajima, FNakada, YYokota, KInoue, YKondo, HYoshino, K New strategy for antedrug application: development of metalloproteinase inhibitors as antipsoriatic drugs. J Med Chem45:930-6 (2002) Stromelysin-1
Name:Stromelysin-1
Type:Enzyme
Mol. Mass.:53973.13
Organism:Homo sapiens (Human)
Description: P08254
Residue:477
BDBM50291705
NameBDBM50291705
Synonyms:(S)-((R)-3-Hydroxycarbamoyl-3,4-dihydro-1H-isoquinolin-2-yl)-(4-methoxy-phenyl)-phosphinic acid 3,3,3-trifluoro-propyl ester | CHEMBL64689
TypeSmall organic molecule
Emp. Form.C20H22F3N2O5P
Mol. Mass.458.3681
SMILESCOc1ccc(cc1)[P@@](=O)(OCCC(F)(F)F)N1Cc2ccccc2C[C@@H]1C(=O)NO