Reaction Details
TargetReverse transcriptase/RNaseH
LigandBDBM50109694
Substrate/Competitorn/a
Meas. Tech.ChEMBL_195678 (CHEMBL800750)
IC50>100000±n/a nM
Citation Tillekeratne, LMSherette, AFulmer, JAHupe, LHupe, DGabbara, SPeliska, JAHudson, RA Differential inhibition of polymerase and strand-transfer activities of HIV-1 reverse transcriptase. Bioorg Med Chem Lett12:525-8 (2002) Reverse transcriptase/RNaseH
Name:Reverse transcriptase/RNaseH
Type:PROTEIN
Mol. Mass.:65229.15
Organism:Human immunodeficiency virus 1
Description:ChEMBL_1473730
Residue:566
BDBM50109694
NameBDBM50109694
Synonyms:3,4,5-Trihydroxy-benzoic acid chroman-3-yl ester | CHEMBL147336
TypeSmall organic molecule
Emp. Form.C16H14O6
Mol. Mass.302.2788
SMILESOc1cc(cc(O)c1O)C(=O)OC1COc2ccccc2C1