Reaction Details
TargetReverse transcriptase/RNaseH
LigandBDBM50109692
Substrate/Competitorn/a
Meas. Tech.ChEMBL_195681 (CHEMBL800598)
IC50 600±n/a nM
Citation Tillekeratne, LMSherette, AFulmer, JAHupe, LHupe, DGabbara, SPeliska, JAHudson, RA Differential inhibition of polymerase and strand-transfer activities of HIV-1 reverse transcriptase. Bioorg Med Chem Lett12:525-8 (2002) Reverse transcriptase/RNaseH
Name:Reverse transcriptase/RNaseH
Type:PROTEIN
Mol. Mass.:65229.15
Organism:Human immunodeficiency virus 1
Description:ChEMBL_1473730
Residue:566
BDBM50109692
NameBDBM50109692
Synonyms:3,4,5-Trihydroxy-benzoic acid 2-(3,4-dihydroxy-phenyl)-ethyl ester | CHEMBL151716
TypeSmall organic molecule
Emp. Form.C15H14O7
Mol. Mass.306.2675
SMILESOc1ccc(CCOC(=O)c2cc(O)c(O)c(O)c2)cc1O