Reaction Details
TargetInterstitial collagenase
LigandBDBM50291707
Substrate/Competitorn/a
Meas. Tech.ChEMBL_106278 (CHEMBL714628)
Ki 11±n/a nM
Citation Sawa, MKondo, HNishimura, S Encounter with unexpected collagenase-1 selective inhibitor: switchover of inhibitor binding pocket induced by fluorine atom. Bioorg Med Chem Lett12:581-4 (2002) Interstitial collagenase
Name:Interstitial collagenase
Type:Enzyme
Mol. Mass.:54010.26
Organism:Homo sapiens (Human)
Description: P03956
Residue:469
BDBM50291707
NameBDBM50291707
Synonyms:(S)-((R)-3-Hydroxycarbamoyl-3,4-dihydro-1H-isoquinolin-2-yl)-(4-methoxy-phenyl)-phosphinic acid 2-fluoro-ethyl ester | CHEMBL347021
TypeSmall organic molecule
Emp. Form.C19H22FN2O5P
Mol. Mass.408.3605
SMILESCOc1ccc(cc1)[P@@](=O)(OCCF)N1Cc2ccccc2C[C@@H]1C(=O)NO