Reaction Details
TargetMisshapen-like kinase 1
LigandBDBM50550593
Substrate/Competitorn/a
Meas. Tech.ChEMBL_2027811 (CHEMBL4681969)
IC50 1.3±n/a nM
Citation Dow, RLAmmirati, MBagley, SWBhattacharya, SKBuckbinder, LCortes, CEl-Kattan, AFFord, KFreeman, GBGuimarães, CRWLiu, SNiosi, MSkoura, ATess, D 2-Aminopyridine-Based Mitogen-Activated Protein Kinase Kinase Kinase Kinase 4 (MAP4K4) Inhibitors: Assessment of Mechanism-Based Safety. J Med Chem61:3114-3125 (2018) 
 
Misshapen-like kinase 1
Name:Misshapen-like kinase 1
Type:PROTEIN
Mol. Mass.:149838.92
Organism:Homo sapiens (Human)
Description:ChEMBL_793919
Residue:1332
BDBM50550593
NameBDBM50550593
Synonyms:CHEMBL4746566
TypeSmall organic molecule
Emp. Form.C21H19ClN2O3
Mol. Mass.382.84
SMILESCC(C)(Oc1ccc(cc1)-c1cnc(N)c(c1)-c1ccc(Cl)cc1)C(O)=O