Reaction Details
TargetGeranylgeranyl transferase type-1 subunit beta/Protein farnesyltransferase/geranylgeranyltransferase type-1 subunit alpha
LigandBDBM50109937
Substrate/Competitorn/a
Meas. Tech.ChEMBL_71666 (CHEMBL871940)
IC50 7.3±n/a nM
Citation Sunami, SOhkubo, MSagara, TOno, JAsahi, SKoito, SMorishima, H A new class of type I protein geranylgeranyltransferase (GGTase I) inhibitor. Bioorg Med Chem Lett12:629-32 (2002) Geranylgeranyl transferase type-1 subunit beta/Protein farnesyltransferase/geranylgeranyltransferase type-1 subunit alpha
Name:Geranylgeranyl transferase type-1 subunit beta/Protein farnesyltransferase/geranylgeranyltransferase type-1 subunit alpha
Type:n/a
Mol. Mass.:n/a
Description:ASSAY_ID of EBI is 70196
Components:This complex has 2 components.
Component 1
Name:Protein farnesyltransferase/geranylgeranyltransferase type-1 subunit alpha
Synonyms:CAAX farnesyltransferase alpha subunit FNTA_HUMAN FTase-alpha Geranylgeranyl Transferase (GGTase-I) Chain A Protein Farnesyltransferase (PFT) Chain A Protein farnesyltransferase Protein farnesyltransferase/geranylgeranyltransferase type I alpha subunit | Ras proteins prenyltransferase alpha
Type:Enzyme
Mol. Mass.:44392.46
Organism:Homo sapiens (Human)
Description:Recombinant human FTase.
Residue:379
Component 2
Name:Geranylgeranyl transferase type-1 subunit beta
Synonyms:2.5.1.59 Geranylgeranyl transferase type I Geranylgeranyl transferase type I subunit beta PGGT1B Protein farnesyl/geranylgeranyl transferase | Type I protein geranyl-geranyltransferase subunit beta
Type:n/a
Mol. Mass.:42369.84
Organism:Homo sapiens (Human)
Description:n/a
Residue:377
BDBM50109937
NameBDBM50109937
Synonyms:(R)-2-[(Indane-2-carbonyl)-amino]-3-naphthalen-1-yl-propionic acid 3-mercapto-propyl ester | CHEMBL345449
TypeSmall organic molecule
Emp. Form.C26H27NO3S
Mol. Mass.433.562
SMILESSCCCOC(=O)[C@@H](Cc1cccc2ccccc12)NC(=O)C1Cc2ccccc2C1