Reaction Details
TargetIntegrin alpha-4/beta-1
LigandBDBM50109980
Substrate/Competitorn/a
Meas. Tech.ChEMBL_214680 (CHEMBL818286)
IC50 1.3±n/a nM
Citation Kopka, IEYoung, DNLin, LSMumford, RAMagriotis, PAMacCoss, MMills, SGVan Riper, GMcCauley, EEgger, LEKidambi, USchmidt, JALyons, KStearns, RVincent, SColletti, AWang, ZTong, SWang, JZheng, SOwens, KLevorse, DHagmann, WK Substituted N-(3,5-dichlorobenzenesulfonyl)-L-prolyl-phenylalanine analogues as potent VLA-4 antagonists. Bioorg Med Chem Lett12:637-40 (2002) Integrin alpha-4/beta-1
Name:Integrin alpha-4/beta-1
Type:n/a
Mol. Mass.:n/a
Description:ASSAY_ID of EBI is 88912
Components:This complex has 2 components.
Component 1
Name:Integrin beta-1
Synonyms:CD_antigen=CD29 Fibronectin receptor beta GPIIA ITGB1 MDF2 | MSK12
Type:Enzyme
Mol. Mass.:88400.38
Organism:Homo sapiens (Human)
Description:P05556
Residue:798
Component 2
Name:Integrin alpha-4
Synonyms:CD49 antigen-like family member D CD49d antigen ITA4_HUMAN Integrin alpha-4 Integrin alpha-IV VLA-4 integrin alpha 4 precursor | integrin alpha-4 precursor
Type:Membrane Protein
Mol. Mass.:114897.35
Organism:Homo sapiens (Human)
Description:P13612
Residue:1032
BDBM50109980
NameBDBM50109980
Synonyms:(S)-2-{[(S)-1-(3,5-Dichloro-benzenesulfonyl)-2-methyl-pyrrolidine-2-carbonyl]-amino}-3-pyridin-4-yl-propionic acid | CHEMBL346501
TypeSmall organic molecule
Emp. Form.C20H21Cl2N3O5S
Mol. Mass.486.369
SMILESC[C@]1(CCCN1S(=O)(=O)c1cc(Cl)cc(Cl)c1)C(=O)N[C@@H](Cc1ccncc1)C(O)=O