Reaction Details
TargetIntegrin alpha-4/beta-7
LigandBDBM50109957
Substrate/Competitorn/a
Meas. Tech.ChEMBL_216159 (CHEMBL815330)
IC50 2100±n/a nM
Citation Kopka, IEYoung, DNLin, LSMumford, RAMagriotis, PAMacCoss, MMills, SGVan Riper, GMcCauley, EEgger, LEKidambi, USchmidt, JALyons, KStearns, RVincent, SColletti, AWang, ZTong, SWang, JZheng, SOwens, KLevorse, DHagmann, WK Substituted N-(3,5-dichlorobenzenesulfonyl)-L-prolyl-phenylalanine analogues as potent VLA-4 antagonists. Bioorg Med Chem Lett12:637-40 (2002) Integrin alpha-4/beta-7
Name:Integrin alpha-4/beta-7
Type:Protein Complex
Mol. Mass.:n/a
Description:The assay uses stably transfected K562 cells expressing human alpha4beta7 integrin.
Components:This complex has 2 components.
Component 1
Name:Integrin alpha-4
Synonyms:CD49 antigen-like family member D CD49d antigen ITA4_HUMAN Integrin alpha-4 Integrin alpha-IV VLA-4 integrin alpha 4 precursor | integrin alpha-4 precursor
Type:Membrane Protein
Mol. Mass.:114897.35
Organism:Homo sapiens (Human)
Description:P13612
Residue:1032
Component 2
Name:Integrin beta-7
Synonyms:ITB7_HUMAN Integrin alpha-4/beta-7 Integrin beta7
Type:Membrane Protein
Mol. Mass.:86893.88
Organism:Homo sapiens (Human)
Description:P26010
Residue:798
BDBM50109957
NameBDBM50109957
Synonyms:(S)-2-{[(S)-1-(3,5-Dichloro-benzenesulfonyl)-pyrrolidine-2-carbonyl]-amino}-3-pyridin-3-yl-propionic acid | CHEMBL345144
TypeSmall organic molecule
Emp. Form.C19H19Cl2N3O5S
Mol. Mass.472.342
SMILESOC(=O)[C@H](Cc1cccnc1)NC(=O)[C@@H]1CCCN1S(=O)(=O)c1cc(Cl)cc(Cl)c1