Reaction Details
TargetHistamine N-methyltransferase
LigandBDBM50110283
Substrate/Competitorn/a
Meas. Tech.ChEMBL_87238 (CHEMBL696458)
IC50 160±n/a nM
Citation Apelt, JLigneau, XPertz, HHArrang, JMGanellin, CRSchwartz, JCSchunack, WStark, H Development of a new class of nonimidazole histamine H(3) receptor ligands with combined inhibitory histamine N-methyltransferase activity. J Med Chem45:1128-41 (2002) Histamine N-methyltransferase
Name:Histamine N-methyltransferase
Type:PROTEIN
Mol. Mass.:33931.03
Organism:Rattus norvegicus
Description:ChEMBL_87236
Residue:295
BDBM50110283
NameBDBM50110283
Synonyms:(7-Chloro-quinolin-4-yl)-(4-piperidin-1-yl-butyl)-amine; Oxalic acid | CHEMBL14849
TypeSmall organic molecule
Emp. Form.C18H24ClN3
Mol. Mass.317.856
SMILESClc1ccc2c(NCCCCN3CCCCC3)ccnc2c1