Reaction Details
TargetHistamine N-methyltransferase
LigandBDBM50110289
Substrate/Competitorn/a
Meas. Tech.ChEMBL_87238 (CHEMBL696458)
IC50 220±n/a nM
Citation Apelt, JLigneau, XPertz, HHArrang, JMGanellin, CRSchwartz, JCSchunack, WStark, H Development of a new class of nonimidazole histamine H(3) receptor ligands with combined inhibitory histamine N-methyltransferase activity. J Med Chem45:1128-41 (2002) Histamine N-methyltransferase
Name:Histamine N-methyltransferase
Type:PROTEIN
Mol. Mass.:33931.03
Organism:Rattus norvegicus
Description:ChEMBL_87236
Residue:295
BDBM50110289
NameBDBM50110289
Synonyms:(7-Chloro-quinolin-4-yl)-(10-piperidin-1-yl-decyl)-amine; Oxalic acid | CHEMBL276305
TypeSmall organic molecule
Emp. Form.C24H36ClN3
Mol. Mass.402.016
SMILESClc1ccc2c(NCCCCCCCCCCN3CCCCC3)ccnc2c1