Reaction Details
TargetHistamine N-methyltransferase
LigandBDBM50110291
Substrate/Competitorn/a
Meas. Tech.ChEMBL_87238 (CHEMBL696458)
IC50 310±n/a nM
Citation Apelt, JLigneau, XPertz, HHArrang, JMGanellin, CRSchwartz, JCSchunack, WStark, H Development of a new class of nonimidazole histamine H(3) receptor ligands with combined inhibitory histamine N-methyltransferase activity. J Med Chem45:1128-41 (2002) Histamine N-methyltransferase
Name:Histamine N-methyltransferase
Type:PROTEIN
Mol. Mass.:33931.03
Organism:Rattus norvegicus
Description:ChEMBL_87236
Residue:295
BDBM50110291
NameBDBM50110291
Synonyms:(7-Chloro-quinolin-4-yl)-[4-(3-piperidin-1-yl-propoxy)-phenyl]-amine; Oxalic acid | CHEMBL14364
TypeSmall organic molecule
Emp. Form.C23H26ClN3O
Mol. Mass.395.925
SMILESClc1ccc2c(Nc3ccc(OCCCN4CCCCC4)cc3)ccnc2c1