Reaction Details
TargetHistamine H3 receptor
LigandBDBM50110297
Substrate/Competitorn/a
Meas. Tech.ChEMBL_85818 (CHEMBL697095)
Ki 7.6±n/a nM
Citation Apelt, JLigneau, XPertz, HHArrang, JMGanellin, CRSchwartz, JCSchunack, WStark, H Development of a new class of nonimidazole histamine H(3) receptor ligands with combined inhibitory histamine N-methyltransferase activity. J Med Chem45:1128-41 (2002) Histamine H3 receptor
Name:Histamine H3 receptor
Type:G Protein-Coupled Receptor (GPCR)
Mol. Mass.:48691.47
Organism:Homo sapiens (Human)
Description:Binding assays were using CHO cells stably expressing hH3R receptors.
Residue:445
BDBM50110297
NameBDBM50110297
Synonyms:(6-Piperidin-1-yl-hexyl)-quinolin-4-yl-amine; Oxalic acid | CHEMBL14573
TypeSmall organic molecule
Emp. Form.C20H29N3
Mol. Mass.311.4644
SMILESC(CCCN1CCCCC1)CCNc1ccnc2ccccc12