Reaction Details
TargetHistamine H3 receptor
LigandBDBM50110306
Substrate/Competitorn/a
Meas. Tech.ChEMBL_85818 (CHEMBL697095)
Ki 1.8±n/a nM
Citation Apelt, JLigneau, XPertz, HHArrang, JMGanellin, CRSchwartz, JCSchunack, WStark, H Development of a new class of nonimidazole histamine H(3) receptor ligands with combined inhibitory histamine N-methyltransferase activity. J Med Chem45:1128-41 (2002) Histamine H3 receptor
Name:Histamine H3 receptor
Type:G Protein-Coupled Receptor (GPCR)
Mol. Mass.:48691.47
Organism:Homo sapiens (Human)
Description:Binding assays were using CHO cells stably expressing hH3R receptors.
Residue:445
BDBM50110306
NameBDBM50110306
Synonyms:(6-Piperidin-1-yl-hexyl)-(1,2,3,4-tetrahydro-acridin-9-yl)-amine; Oxalic acid | CHEMBL277061
TypeSmall organic molecule
Emp. Form.C24H35N3
Mol. Mass.365.5548
SMILESC(CCCN1CCCCC1)CCNc1c2CCCCc2nc2ccccc12