Reaction Details
TargetHistamine H3 receptor
LigandBDBM50110293
Substrate/Competitorn/a
Meas. Tech.ChEMBL_85818 (CHEMBL697095)
Ki 362±n/a nM
Citation Apelt, JLigneau, XPertz, HHArrang, JMGanellin, CRSchwartz, JCSchunack, WStark, H Development of a new class of nonimidazole histamine H(3) receptor ligands with combined inhibitory histamine N-methyltransferase activity. J Med Chem45:1128-41 (2002) Histamine H3 receptor
Name:Histamine H3 receptor
Type:G Protein-Coupled Receptor (GPCR)
Mol. Mass.:48691.47
Organism:Homo sapiens (Human)
Description:Binding assays were using CHO cells stably expressing hH3R receptors.
Residue:445
BDBM50110293
NameBDBM50110293
Synonyms:CHEMBL14860 | Methyl-(2-piperidin-1-yl-ethyl)-quinolin-4-yl-amine; Oxalic acid
TypeSmall organic molecule
Emp. Form.C17H23N3
Mol. Mass.269.3846
SMILESCN(CCN1CCCCC1)c1ccnc2ccccc12