Reaction Details
TargetHistamine H3 receptor
LigandBDBM50110307
Substrate/Competitorn/a
Meas. Tech.ChEMBL_85818 (CHEMBL697095)
Ki 70±n/a nM
Citation Apelt, JLigneau, XPertz, HHArrang, JMGanellin, CRSchwartz, JCSchunack, WStark, H Development of a new class of nonimidazole histamine H(3) receptor ligands with combined inhibitory histamine N-methyltransferase activity. J Med Chem45:1128-41 (2002) Histamine H3 receptor
Name:Histamine H3 receptor
Type:G Protein-Coupled Receptor (GPCR)
Mol. Mass.:48691.47
Organism:Homo sapiens (Human)
Description:Binding assays were using CHO cells stably expressing hH3R receptors.
Residue:445
BDBM50110307
NameBDBM50110307
Synonyms:(3-Methyl-quinolin-4-yl)-(3-piperidin-1-yl-propyl)-amine; Oxalic acid | CHEMBL275874
TypeSmall organic molecule
Emp. Form.C18H25N3
Mol. Mass.283.4112
SMILESCc1cnc2ccccc2c1NCCCN1CCCCC1