Reaction Details
TargetHistamine H3 receptor
LigandBDBM50110294
Substrate/Competitorn/a
Meas. Tech.ChEMBL_85818 (CHEMBL697095)
Ki 15±n/a nM
Citation Apelt, JLigneau, XPertz, HHArrang, JMGanellin, CRSchwartz, JCSchunack, WStark, H Development of a new class of nonimidazole histamine H(3) receptor ligands with combined inhibitory histamine N-methyltransferase activity. J Med Chem45:1128-41 (2002) Histamine H3 receptor
Name:Histamine H3 receptor
Type:G Protein-Coupled Receptor (GPCR)
Mol. Mass.:48691.47
Organism:Homo sapiens (Human)
Description:Binding assays were using CHO cells stably expressing hH3R receptors.
Residue:445
BDBM50110294
NameBDBM50110294
Synonyms:(5-Piperidin-1-yl-pentyl)-quinolin-4-yl-amine; Oxalic acid | CHEMBL15098
TypeSmall organic molecule
Emp. Form.C19H27N3
Mol. Mass.297.4378
SMILESC(CCNc1ccnc2ccccc12)CCN1CCCCC1