Reaction Details
TargetProstaglandin G/H synthase 2
LigandBDBM50110483
Substrate/Competitorn/a
Meas. Tech.ChEMBL_159933 (CHEMBL769658)
IC50<100±n/a nM
Citation Barbey, SGoossens, LTaverne, TCornet, JChoesmel, VRouaud, CGimeno, GYannic-Arnoult, SMichaux, CCharlier, CHoussin, RHénichart, JP Synthesis and activity of a new methoxytetrahydropyran derivative as dual cyclooxygenase-2/5-lipoxygenase inhibitor. Bioorg Med Chem Lett12:779-82 (2002) Prostaglandin G/H synthase 2
Name:Prostaglandin G/H synthase 2
Type:Enzyme
Mol. Mass.:69003.89
Organism:Homo sapiens (Human)
Description:Recombinant Cox-2 provided by Cayman (Cayman Chemical Co.,Ann Arbor, MI).
Residue:604
BDBM50110483
NameBDBM50110483
Synonyms:2-[3-Fluoro-5-(4-methoxy-tetrahydro-pyran-4-yl)-phenoxymethyl]-4-(4-fluoro-phenyl)-oxazole-5-sulfonic acid amide | CHEMBL348825
TypeSmall organic molecule
Emp. Form.C22H22F2N2O6S
Mol. Mass.480.482
SMILESCOC1(CCOCC1)c1cc(F)cc(OCc2nc(c(o2)S(N)(=O)=O)-c2ccc(F)cc2)c1