Reaction Details
TargetProstaglandin G/H synthase 2
LigandBDBM50110485
Substrate/Competitorn/a
Meas. Tech.ChEMBL_159933 (CHEMBL769658)
IC50<100±n/a nM
Citation Barbey, SGoossens, LTaverne, TCornet, JChoesmel, VRouaud, CGimeno, GYannic-Arnoult, SMichaux, CCharlier, CHoussin, RHénichart, JP Synthesis and activity of a new methoxytetrahydropyran derivative as dual cyclooxygenase-2/5-lipoxygenase inhibitor. Bioorg Med Chem Lett12:779-82 (2002) Prostaglandin G/H synthase 2
Name:Prostaglandin G/H synthase 2
Type:Enzyme
Mol. Mass.:69003.89
Organism:Homo sapiens (Human)
Description:Recombinant Cox-2 provided by Cayman (Cayman Chemical Co.,Ann Arbor, MI).
Residue:604
BDBM50110485
NameBDBM50110485
Synonyms:5-(4-Chloro-phenyl)-3-[3-fluoro-5-(4-methoxy-tetrahydro-pyran-4-yl)-phenoxymethyl]-pyrazole-1-sulfonic acid amide | CHEMBL349370
TypeSmall organic molecule
Emp. Form.C22H23ClFN3O5S
Mol. Mass.495.952
SMILESCOC1(CCOCC1)c1cc(F)cc(OCc2cc(-c3ccc(Cl)cc3)n(n2)S(N)(=O)=O)c1