Reaction Details
TargetReverse transcriptase/RNaseH
LigandBDBM50110791
Substrate/Competitorn/a
Meas. Tech.ChEMBL_195083 (CHEMBL797537)
IC50>250000±n/a nM
Citation Khandazhinskaya, ALShirokova, EASkoblov, YSVictorova, LSGoryunova, LYBeabealashvilli, RSPronyaeva, TRFedyuk, NVZolin, VVPokrovsky, AGKukhanova, MK Carbocyclic dinucleoside polyphosphonates: interaction with HIV reverse transcriptase and antiviral activity. J Med Chem45:1284-91 (2002) Reverse transcriptase/RNaseH
Name:Reverse transcriptase/RNaseH
Type:PROTEIN
Mol. Mass.:65229.15
Organism:Human immunodeficiency virus 1
Description:ChEMBL_1473730
Residue:566
BDBM50110791
NameBDBM50110791
Synonyms:CHEMBL23522 | P,P'-Bis {[4-(guanine-9-yl)cyclopent-2-enyl]oxy-methylphosphonyl}dibromodiphosphonate
TypeSmall organic molecule
Emp. Form.C23H28Br2N10O14P4
Mol. Mass.952.23
SMILESNc1nc2n(cnc2c(=O)[nH]1)C1CC(OCP(O)(=O)OP(O)(=O)C(Br)(Br)P(O)(=O)OP(O)(=O)COC2CC(C=C2)n2cnc3c2nc(N)[nH]c3=O)C=C1