Reaction Details
TargetReverse transcriptase/RNaseH
LigandBDBM50110795
Substrate/Competitorn/a
Meas. Tech.ChEMBL_195083 (CHEMBL797537)
IC50 20000±n/a nM
Citation Khandazhinskaya, ALShirokova, EASkoblov, YSVictorova, LSGoryunova, LYBeabealashvilli, RSPronyaeva, TRFedyuk, NVZolin, VVPokrovsky, AGKukhanova, MK Carbocyclic dinucleoside polyphosphonates: interaction with HIV reverse transcriptase and antiviral activity. J Med Chem45:1284-91 (2002) Reverse transcriptase/RNaseH
Name:Reverse transcriptase/RNaseH
Type:PROTEIN
Mol. Mass.:65229.15
Organism:Human immunodeficiency virus 1
Description:ChEMBL_1473730
Residue:566
BDBM50110795
NameBDBM50110795
Synonyms:CHEMBL23428 P,P'-Bis {[4-(adenine-9-yl)cyclopent-2-enyl]oxy-methylphosphonyl}difluorodiphosphonate
TypeSmall organic molecule
Emp. Form.C23H28F2N10O12P4
Mol. Mass.798.4201
SMILESNc1ncnc2n(cnc12)C1CC(OCP(O)(=O)OP(O)(=O)C(F)(F)P(O)(=O)OP(O)(=O)COC2CC(C=C2)n2cnc3c(N)ncnc23)C=C1