Reaction Details
TargetReverse transcriptase/RNaseH
LigandBDBM50110803
Substrate/Competitorn/a
Meas. Tech.ChEMBL_195083 (CHEMBL797537)
IC50>1000000±n/a nM
Citation Khandazhinskaya, ALShirokova, EASkoblov, YSVictorova, LSGoryunova, LYBeabealashvilli, RSPronyaeva, TRFedyuk, NVZolin, VVPokrovsky, AGKukhanova, MK Carbocyclic dinucleoside polyphosphonates: interaction with HIV reverse transcriptase and antiviral activity. J Med Chem45:1284-91 (2002) Reverse transcriptase/RNaseH
Name:Reverse transcriptase/RNaseH
Type:PROTEIN
Mol. Mass.:65229.15
Organism:Human immunodeficiency virus 1
Description:ChEMBL_1473730
Residue:566
BDBM50110803
NameBDBM50110803
Synonyms:(4-(6-amino-9H-purin-9-yl)cyclopent-2-enyloxy)methyl(dibromo(phosphono)methyl)diphosphonic acid CHEMBL423652
TypeSmall organic molecule
Emp. Form.C12H16Br2N5O9P3
Mol. Mass.627.013
SMILESNc1ncnc2n(cnc12)C1CC(OCP(O)(=O)OP(O)(=O)C(Br)(Br)P(O)(O)=O)C=C1