Reaction Details
TargetDNA polymerase I, thermostable
LigandBDBM50111321
Substrate/Competitorn/a
Meas. Tech.ChEBML_209735
IC50>10000±n/a nM
Citation Alberti, PSchmitt, PNguyen, CHRivalle, CHoarau, MGrierson, DSMergny, JL Benzoindoloquinolines interact with DNA tetraplexes and inhibit telomerase. Bioorg Med Chem Lett12:1071-4 (2002) DNA polymerase I, thermostable
Name:DNA polymerase I, thermostable
Type:PROTEIN
Mol. Mass.:93906.95
Organism:Thermus aquaticus
Description:ChEMBL_1289218
Residue:832
BDBM50111321
NameBDBM50111321
Synonyms:CHEMBL10763 | N'-(11-Methoxy-13H-5,13-diaza-dibenzo[a,i]fluoren-6-yl)-N,N-dimethyl-ethane-1,2-diamine
TypeSmall organic molecule
Emp. Form.C24H24N4O
Mol. Mass.384.4736
SMILESCOc1ccc2ccc3c([nH]c4c3c(NCCN(C)C)nc3ccccc43)c2c1