Reaction Details
TargetDNA polymerase I, thermostable
LigandBDBM50111322
Substrate/Competitorn/a
Meas. Tech.ChEBML_209735
IC50 5000±n/a nM
Citation Alberti, PSchmitt, PNguyen, CHRivalle, CHoarau, MGrierson, DSMergny, JL Benzoindoloquinolines interact with DNA tetraplexes and inhibit telomerase. Bioorg Med Chem Lett12:1071-4 (2002) DNA polymerase I, thermostable
Name:DNA polymerase I, thermostable
Type:PROTEIN
Mol. Mass.:93906.95
Organism:Thermus aquaticus
Description:ChEMBL_1289218
Residue:832
BDBM50111322
NameBDBM50111322
Synonyms:CHEMBL274335 | N,N-Dimethyl-N'-(11-nitro-13H-5,13-diaza-dibenzo[a,i]fluoren-6-yl)-propane-1,3-diamine
TypeSmall organic molecule
Emp. Form.C24H23N5O2
Mol. Mass.413.4717
SMILESCN(C)CCCNc1nc2ccccc2c2[nH]c3c(ccc4ccc(cc34)[N+]([O-])=O)c12