Reaction Details
TargetTelomerase reverse transcriptase
LigandBDBM50111323
Substrate/Competitorn/a
Meas. Tech.ChEBML_210224
IC50 1100±n/a nM
Citation Alberti, PSchmitt, PNguyen, CHRivalle, CHoarau, MGrierson, DSMergny, JL Benzoindoloquinolines interact with DNA tetraplexes and inhibit telomerase. Bioorg Med Chem Lett12:1071-4 (2002) Telomerase reverse transcriptase
Name:Telomerase reverse transcriptase
Type:PROTEIN
Mol. Mass.:127099.03
Organism:Homo sapiens (Human)
Description:ChEMBL_1447029
Residue:1132
BDBM50111323
NameBDBM50111323
Synonyms:CHEMBL276202 | N'-(11-Methoxy-13H-5,13-diaza-dibenzo[a,i]fluoren-6-yl)-N,N-dimethyl-propane-1,3-diamine
TypeSmall organic molecule
Emp. Form.C25H26N4O
Mol. Mass.398.5001
SMILESCOc1ccc2ccc3c([nH]c4c3c(NCCCN(C)C)nc3ccccc43)c2c1