Reaction Details
TargetCyclin-dependent kinase 5 activator 1
LigandBDBM5718
Substrate/Competitorn/a
Meas. Tech.ChEMBL_51325 (CHEMBL663604)
IC50 7000±n/a nM
Citation Song, YWang, JTeng, SFKesuma, DDeng, YDuan, JWang, JHQi, RZSim, MM Beta-carbolines as specific inhibitors of cyclin-dependent kinases. Bioorg Med Chem Lett12:1129-32 (2002) Cyclin-dependent kinase 5 activator 1
Name:Cyclin-dependent kinase 5 activator 1
Type:Protein Complex
Mol. Mass.:n/a
Description:n/a
Components:This complex has 2 components.
Component 1
Name:Cyclin-dependent kinase 5
Synonyms:CDK5 CDKN5 Cyclin-dependent kinase 5 (CDK5/ p25) Cyclin-dependent-like kinase 5 PSSALRE Tau protein kinase II catalytic subunit
Type:Enzyme Subunit
Mol. Mass.:33308.61
Organism:Homo sapiens (Human)
Description:n/a
Residue:292
Component 2
Name:Cyclin-dependent kinase 5 activator 1
Synonyms:CD5R1_HUMAN CDK5R1 Cyclin-dependent kinase 5 (CDK5/p25) NCK5A p35
Type:Enzyme Subunit
Mol. Mass.:34077.43
Organism:Homo sapiens (Human)
Description:Q15078
Residue:307
BDBM5718
NameBDBM5718
Synonyms:2,6,9-Trisubstituted purine deriv. 26 2-{[6-(benzylamino)-9-methyl-9H-purin-2-yl]amino}ethanol CHEMBL280074 purine deriv. 5
TypeSmall organic molecule
Emp. Form.C15H18N6O
Mol. Mass.298.343
SMILESCn1cnc2c(NCc3ccccc3)nc(NCCO)nc12