Reaction Details
TargetCyclin-A1/Cyclin-A2/Cyclin-dependent kinase 2
LigandBDBM100152
Substrate/Competitorn/a
Meas. Tech.ChEMBL_50835 (CHEMBL657267)
IC50 35000±n/a nM
Citation Song, YWang, JTeng, SFKesuma, DDeng, YDuan, JWang, JHQi, RZSim, MM Beta-carbolines as specific inhibitors of cyclin-dependent kinases. Bioorg Med Chem Lett12:1129-32 (2002) Cyclin-A1/Cyclin-A2/Cyclin-dependent kinase 2
Name:Cyclin-A1/Cyclin-A2/Cyclin-dependent kinase 2
Type:n/a
Mol. Mass.:n/a
Description:ASSAY_ID of EBI is 42813
Components:This complex has 3 components.
Component 1
Name:Cyclin-A2
Synonyms:CCN1 CCNA1 CCNA2_HUMAN Cyclin-A
Type:Enzyme Subunit
Mol. Mass.:48550.19
Organism:Homo sapiens (Human)
Description:P20248
Residue:432
Component 2
Name:Cyclin-A1
Synonyms:CCNA1 CDK2/Cyclin A1 Cyclin-A1/Cyclin-dependent kinase 4
Type:Enzyme
Mol. Mass.:52343.37
Organism:Homo sapiens (Human)
Description:P78396
Residue:465
Component 3
Name:Cyclin-dependent kinase 2
Synonyms:CDK2 CDK2_HUMAN Cell division protein kinase 2 Protein cereblon/Cyclin-dependent kinase 2 | p33 protein kinase
Type:Enzyme Subunit
Mol. Mass.:33938.17
Organism:Homo sapiens (Human)
Description:P24941
Residue:298
Component 4
Name:Cyclin-A2
Synonyms:CCN1 CCNA1 CCNA2_HUMAN Cyclin-A
Type:Enzyme Subunit
Mol. Mass.:48550.19
Organism:Homo sapiens (Human)
Description:P20248
Residue:432
BDBM100152
NameBDBM100152
Synonyms:7-methoxy-1-methyl-9H-beta-carboline;hydrochloride HARMINE MLS002153910 cid_5359389
TypeSmall organic molecule
Emp. Form.C13H12N2O
Mol. Mass.212.2472
SMILESCOc1ccc2c(c1)[nH]c1c(C)nccc21