Reaction Details
TargetDelta-type opioid receptor
LigandBDBM50001468
Substrate/Competitorn/a
Meas. Tech.ChEBML_145885
IC50 0.582000±n/a nM
Citation Ambo, AMurase, HNiizuma, HOuchi, HYamamoto, YSasaki, Y Dermorphin and deltorphin heptapeptide analogues: replacement of Phe residue by Dmp greatly improves opioid receptor affinity and selectivity. Bioorg Med Chem Lett12:879-81 (2002) Delta-type opioid receptor
Name:Delta-type opioid receptor
Type:Enzyme Catalytic Domain
Mol. Mass.:40577.25
Organism:MOUSE
Description:P32300
Residue:372
BDBM50001468
NameBDBM50001468
Synonyms:(S)-3-((S)-2-{(R)-2-[(S)-2-Amino-3-(4-hydroxy-phenyl)-propionylamino]-propionylamino}-3-phenyl-propionylamino)-N-{(S)-1-[(S)-1-(carbamoylmethyl-carbamoyl)-2-methyl-propylcarbamoyl]-2-methyl-propyl}-succinamic acid CHEMBL317956 deltorphin C
TypeSmall organic molecule
Emp. Form.C37H52N8O10
Mol. Mass.768.8564
SMILESCC(C)[C@H](NC(=O)[C@@H](NC(=O)[C@H](CC(O)=O)NC(=O)[C@H](Cc1ccccc1)NC(=O)[C@@H](C)NC(=O)[C@@H](N)Cc1ccc(O)cc1)C(C)C)C(=O)NCC(N)=O