Reaction Details
TargetDelta-type opioid receptor
LigandBDBM50059841
Substrate/Competitorn/a
Meas. Tech.ChEBML_145885
IC50 34±n/a nM
Citation Ambo, AMurase, HNiizuma, HOuchi, HYamamoto, YSasaki, Y Dermorphin and deltorphin heptapeptide analogues: replacement of Phe residue by Dmp greatly improves opioid receptor affinity and selectivity. Bioorg Med Chem Lett12:879-81 (2002) Delta-type opioid receptor
Name:Delta-type opioid receptor
Type:Enzyme Catalytic Domain
Mol. Mass.:40577.25
Organism:MOUSE
Description:P32300
Residue:372
BDBM50059841
NameBDBM50059841
Synonyms:(S)-1-[(S)-2-[2-((S)-2-{(R)-2-[(S)-2-Amino-3-(4-hydroxy-phenyl)-propionylamino]-propionylamino}-3-phenyl-propionylamino)-acetylamino]-3-(4-hydroxy-phenyl)-propionyl]-pyrrolidine-2-carboxylic acid ((S)-1-carbamoyl-2-hydroxy-ethyl)-amide 1-[2-[2-(2-{2-[2-Amino-3-(4-hydroxy-phenyl)-propionylamino]-propionylamino}-3-phenyl-propionylamino)-acetylamino]-3-(4-hydroxy-phenyl)-propionyl]-pyrrolidine-2-carboxylic acid (1-carbamoyl-2-hydroxy-ethyl)-amide 1-[2-[2-(2-{2-[2-Amino-3-(4-hydroxy-phenyl)-propionylamino]-propionylamino}-3-phenyl-propionylamino)-acetylamino]-3-(4-hydroxy-phenyl)-propionyl]-pyrrolidine-2-carboxylic acid (1-carbamoyl-2-hydroxy-ethyl)-amide(Dermorphin) DERMORPHIN H-Tyr-D-Ala-Phe-Gly-Tyr-Pro-Ser-NH2 YAFGYPS-NH2
TypeSmall organic molecule
Emp. Form.C40H50N8O10
Mol. Mass.802.8726
SMILESC[C@@H](NC(=O)[C@@H](N)Cc1ccc(O)cc1)C(=O)N[C@@H](Cc1ccccc1)C(=O)NCC(=O)N[C@@H](Cc1ccc(O)cc1)C(=O)N1CCC[C@H]1C(=O)N[C@@H](CO)C(N)=O