Reaction Details
TargetAdenosine kinase
LigandBDBM50049820
Substrate/Competitorn/a
Meas. Tech.ChEMBL_31119 (CHEMBL643547)
IC50 470±n/a nM
Citation Srikanth, KDebnath, BJha, T QSAR study on adenosine kinase inhibition of pyrrolo[2,3-d]pyrimidine nucleoside analogues using the hansch approach. Bioorg Med Chem Lett12:899-902 (2002) Adenosine kinase
Name:Adenosine kinase
Type:PROTEIN
Mol. Mass.:40545.97
Organism:Homo sapiens (Human)
Description:ChEMBL_1467841
Residue:362
BDBM50049820
NameBDBM50049820
Synonyms:4-Amino-5-carboxamide-7-(D-ribofuranosyl)pyrrolo[2,3-d]pyrimidine 4-Amino-7-(3,4-dihydroxy-5-hydroxymethyl-tetrahydro-furan-2-yl)-7H-pyrrolo[2,3-d]pyrimidine-5-carboxylic acid amide CHEMBL101892 cid_5153
TypeSmall organic molecule
Emp. Form.C12H15N5O5
Mol. Mass.309.278
SMILESNC(=O)c1cn([C@@H]2O[C@H](CO)[C@@H](O)[C@H]2O)c2ncnc(N)c12