Reaction Details
TargetGamma-aminobutyric acid receptor subunit alpha-1/beta-3/gamma-2
LigandBDBM50112237
Substrate/Competitorn/a
Meas. Tech.ChEMBL_70101 (CHEMBL681636)
Ki 24±n/a nM
Citation Collins, IMoyes, CDavey, WBRowley, MBromidge, FAQuirk, KAtack, JRMcKernan, RMThompson, SAWafford, KDawson, GRPike, ASohal, BTsou, NNBall, RGCastro, JL 3-Heteroaryl-2-pyridones: benzodiazepine site ligands with functional delectivity for alpha 2/alpha 3-subtypes of human GABA(A) receptor-ion channels. J Med Chem45:1887-900 (2002) Gamma-aminobutyric acid receptor subunit alpha-1/beta-3/gamma-2
Name:Gamma-aminobutyric acid receptor subunit alpha-1/beta-3/gamma-2
Type:Protein
Mol. Mass.:n/a
Description:n/a
Components:This complex has 3 components.
Component 1
Name:Gamma-aminobutyric acid receptor subunit alpha-1
Synonyms:Benzodiazepine central GABA A Benzodiazepine liver GABA(A) receptor subunit alpha-1 GABA-A receptor GBRA1_HUMAN TBPS | agonist GABA site
Type:Protein
Mol. Mass.:51817.35
Organism:Homo sapiens (Human)
Description:P14867
Residue:456
Component 2
Name:Gamma-aminobutyric acid receptor subunit beta-3
Synonyms:GABA A receptor alpha-4/beta-3/gamma-2 GABA-A receptor GBRB3_HUMAN | agonist GABA site
Type:PROTEIN
Mol. Mass.:54130.51
Organism:Homo sapiens (Human)
Description:ChEMBL_448071
Residue:473
Component 3
Name:Gamma-aminobutyric acid receptor subunit gamma-2
Synonyms:GABA(A) receptor subunit gamma-2 GBRG2_HUMAN
Type:PROTEIN
Mol. Mass.:54172.74
Organism:Homo sapiens (Human)
Description:EBI_217
Residue:467
BDBM50112237
NameBDBM50112237
Synonyms:1'-Methyl-5'-(4-methyl-thiazol-2-yl)-1'H-[4,2';3',4'']terpyridin-6'-one | CHEMBL59427
TypeSmall organic molecule
Emp. Form.C20H16N4OS
Mol. Mass.360.432
SMILESCc1csc(n1)-c1cc(-c2ccncc2)c(-c2ccncc2)n(C)c1=O