Reaction Details
TargetProtein farnesyltransferase subunit beta/geranylgeranyltransferase type-1 subunit alpha
LigandBDBM50112379
Substrate/Competitorn/a
Meas. Tech.ChEMBL_70146 (CHEMBL685969)
IC50 1.2±n/a nM
Citation Nguyen, DNStump, CAWalsh, ESFernandes, CDavide, JPEllis-Hutchings, MRobinson, RGWilliams, TMLobell, RBHuber, HEBuser, CA Potent inhibitors of farnesyltransferase and geranylgeranyltransferase-I. Bioorg Med Chem Lett12:1269-73 (2002) Protein farnesyltransferase subunit beta/geranylgeranyltransferase type-1 subunit alpha
Name:Protein farnesyltransferase subunit beta/geranylgeranyltransferase type-1 subunit alpha
Type:Protein Complex
Mol. Mass.:n/a
Description:Purified bovine brain FTase.
Components:This complex has 2 components.
Component 1
Name:Protein farnesyltransferase/geranylgeranyltransferase type-1 subunit alpha
Synonyms:CAAX farnesyltransferase alpha subunit FNTA_BOVIN GGTase-I-alpha Protein Farnesyltransferase (PFT) Chain A Protein farnesyltransferase/geranylgeranyltransferase type I alpha subunit Type I protein geranyl-geranyltransferase alpha subunit
Type:Enzyme
Mol. Mass.:43827.38
Organism:Bos taurus (bovine)
Description:The enzyme was purified from a bovine brain homogenate by sequential ammonium sulfate fractionation and affinity chromatography.
Residue:375
Component 2
Name:Protein farnesyltransferase subunit beta
Synonyms:CAAX farnesyltransferase subunit beta FNTB_BOVIN Protein farnesyltransferase Protein farnesyltransferase subunit beta Ras proteins prenyltransferase subunit beta
Type:Enzyme Subunit
Mol. Mass.:48758.49
Organism:Bos taurus (bovine)
Description:Protein farnesyltransferase subunit beta
Residue:437
BDBM50112379
NameBDBM50112379
Synonyms:1-(3-Chloro-phenyl)-4-{2-[3-(2-methoxy-4'-trifluoromethyl-biphenyl-4-ylmethyl)-3H-imidazol-4-yl]-ethyl}-piperazin-2-one | CHEMBL23460
TypeSmall organic molecule
Emp. Form.C30H28ClF3N4O2
Mol. Mass.569.017
SMILESCOc1cc(Cn2cncc2CCN2CCN(C(=O)C2)c2cccc(Cl)c2)ccc1-c1ccc(cc1)C(F)(F)F