Reaction Details
TargetProtein farnesyltransferase subunit beta/geranylgeranyltransferase type-1 subunit alpha
LigandBDBM50112383
Substrate/Competitorn/a
Meas. Tech.ChEBML_154440
EC50 6.9±n/a nM
Citation Nguyen, DNStump, CAWalsh, ESFernandes, CDavide, JPEllis-Hutchings, MRobinson, RGWilliams, TMLobell, RBHuber, HEBuser, CA Potent inhibitors of farnesyltransferase and geranylgeranyltransferase-I. Bioorg Med Chem Lett12:1269-73 (2002) Protein farnesyltransferase subunit beta/geranylgeranyltransferase type-1 subunit alpha
Name:Protein farnesyltransferase subunit beta/geranylgeranyltransferase type-1 subunit alpha
Type:Protein Complex
Mol. Mass.:n/a
Description:To express recombinant enzyme in E. coli, the cloned human alpha and beta subunits were co-expressed from a plasmid, in which their expression was translationally coupled.
Components:This complex has 2 components.
Component 1
Name:Protein farnesyltransferase subunit beta
Synonyms:CAAX farnesyltransferase subunit alpha FNTB FTase-alpha GGTase-I-alpha Protein farnesyl/geranylgeranyl transferase Protein farnesyltransferase subunit beta Protein farnesyltransferase/geranylgeranyltransferase type-1 subunit alpha Ras proteins prenyltransferase subunit beta | Type I protein geranyl-geranyltransferase subunit alpha
Type:Enzyme Subunit
Mol. Mass.:48766.02
Organism:Homo sapiens (Human)
Description:Protein farnesyltransferase subunit beta
Residue:437
Component 2
Name:Protein farnesyltransferase/geranylgeranyltransferase type-1 subunit alpha
Synonyms:CAAX farnesyltransferase alpha subunit FNTA_HUMAN FTase-alpha Geranylgeranyl Transferase (GGTase-I) Chain A Protein Farnesyltransferase (PFT) Chain A Protein farnesyltransferase Protein farnesyltransferase/geranylgeranyltransferase type I alpha subunit | Ras proteins prenyltransferase alpha
Type:Enzyme
Mol. Mass.:44392.46
Organism:Homo sapiens (Human)
Description:Recombinant human FTase.
Residue:379
BDBM50112383
NameBDBM50112383
Synonyms:17-(5,5,5-trifluoropentyl)-19-oxa-2,5,10,12-tetraazahexacyclo[18.6.2.22,5.114,18.08,12.023,27]hentriaconta-1(27),8,10,14(31),15,17,20(28),21,23,25-decaen-3-one | CHEMBL23650
TypeSmall organic molecule
Emp. Form.C31H31F3N4O2
Mol. Mass.548.5986
SMILESFC(F)(F)CCCCc1ccc2Cn3cncc3CCN3CCN(C(=O)C3)c3cccc4ccc(Oc1c2)cc34