Reaction Details
TargetPeptidyl-prolyl cis-trans isomerase FKBP1A
LigandBDBM50113056
Substrate/Competitorn/a
Meas. Tech.ChEBML_66266
Ki 92±n/a nM
Citation Choi, CLi, JHVaal, MThomas, CLimburg, DWu, YQChen, YSoni, RScott, CRoss, DTGuo, HHoworth, PValentine, HLiang, SSpicer, DFuller, MSteiner, JHamilton, GS Use of parallel-synthesis combinatorial libraries for rapid identification of potent FKBP12 inhibitors. Bioorg Med Chem Lett12:1421-8 (2002) Peptidyl-prolyl cis-trans isomerase FKBP1A
Name:Peptidyl-prolyl cis-trans isomerase FKBP1A
Type:Isomerase
Mol. Mass.:11953.09
Organism:Homo sapiens (Human)
Description:P62942
Residue:108
BDBM50113056
NameBDBM50113056
Synonyms:1-Phenylmethanesulfonyl-piperidine-2-carboxylic acid 3-(4-methoxy-phenyl)-propyl ester | CHEMBL286230
TypeSmall organic molecule
Emp. Form.C23H29NO5S
Mol. Mass.431.545
SMILESCOc1ccc(CCCOC(=O)C2CCCCN2S(=O)(=O)Cc2ccccc2)cc1