Reaction Details
TargetGeranylgeranyl pyrophosphate synthase
LigandBDBM50098379
Substrate/Competitorn/a
Meas. Tech.ChEMBL_71679 (CHEMBL681671)
IC50 200000±n/a nM
Citation Szabo, CMMatsumura, YFukura, SMartin, MBSanders, JMSengupta, SCieslak, JALoftus, TCLea, CRLee, HJKoohang, ACoates, RMSagami, HOldfield, E Inhibition of geranylgeranyl diphosphate synthase by bisphosphonates and diphosphates: a potential route to new bone antiresorption and antiparasitic agents. J Med Chem45:2185-96 (2002) Geranylgeranyl pyrophosphate synthase
Name:Geranylgeranyl pyrophosphate synthase
Type:Homooctamer; transferase
Mol. Mass.:34867.94
Organism:Homo sapiens (Human)
Description:Recombinant human GGPPS was cloned and expressed in E. coli.
Residue:300
BDBM50098379
NameBDBM50098379
Synonyms:(1-Hydroxy-1-phosphono-pentyl)-phosphonic acid 1-hydroxypentane-1,1-diyldiphosphonic acid | CHEMBL299491
TypeSmall organic molecule
Emp. Form.C5H14O7P2
Mol. Mass.248.108
SMILESCCCCC(O)(P(O)(O)=O)P(O)(O)=O