Reaction Details
TargetGeranylgeranyl pyrophosphate synthase
LigandBDBM50113288
Substrate/Competitorn/a
Meas. Tech.ChEMBL_71679 (CHEMBL681671)
IC50 2200±n/a nM
Citation Szabo, CMMatsumura, YFukura, SMartin, MBSanders, JMSengupta, SCieslak, JALoftus, TCLea, CRLee, HJKoohang, ACoates, RMSagami, HOldfield, E Inhibition of geranylgeranyl diphosphate synthase by bisphosphonates and diphosphates: a potential route to new bone antiresorption and antiparasitic agents. J Med Chem45:2185-96 (2002) Geranylgeranyl pyrophosphate synthase
Name:Geranylgeranyl pyrophosphate synthase
Type:Homooctamer; transferase
Mol. Mass.:34867.94
Organism:Homo sapiens (Human)
Description:Recombinant human GGPPS was cloned and expressed in E. coli.
Residue:300
BDBM50113288
NameBDBM50113288
Synonyms:(Octylamino-phosphono-methyl)-phosphonic acid CHEMBL52251 | N-octyl-aminomethylene bisphosphonate
TypeSmall organic molecule
Emp. Form.C9H23NO6P2
Mol. Mass.303.2295
SMILESCCCCCCCCN=C(P(O)(O)O)P(O)(O)=O