Reaction Details
TargetGeranylgeranyl pyrophosphate synthase
LigandBDBM50113292
Substrate/Competitorn/a
Meas. Tech.ChEMBL_71679 (CHEMBL681671)
IC50 240000±n/a nM
Citation Szabo, CMMatsumura, YFukura, SMartin, MBSanders, JMSengupta, SCieslak, JALoftus, TCLea, CRLee, HJKoohang, ACoates, RMSagami, HOldfield, E Inhibition of geranylgeranyl diphosphate synthase by bisphosphonates and diphosphates: a potential route to new bone antiresorption and antiparasitic agents. J Med Chem45:2185-96 (2002) Geranylgeranyl pyrophosphate synthase
Name:Geranylgeranyl pyrophosphate synthase
Type:Homooctamer; transferase
Mol. Mass.:34867.94
Organism:Homo sapiens (Human)
Description:Recombinant human GGPPS was cloned and expressed in E. coli.
Residue:300
BDBM50113292
NameBDBM50113292
Synonyms:2-[methyl-(4-methyl-pent-3-enyl)-amino]-ethyl trihydrogendiphosphate(3-aza-GPP) | CHEMBL68666
TypeSmall organic molecule
Emp. Form.C9H21NO7P2
Mol. Mass.317.2131
SMILES[#6]-[#7](-[#6]-[#6]-[#8]P([#8])(=O)[#8]P([#8])([#8])=O)-[#6]-[#6]\[#6]=[#6](\[#6])-[#6]