Reaction Details
Target5-hydroxytryptamine receptor 2A
LigandBDBM50113328
Substrate/Competitorn/a
Meas. Tech.ChEMBL_2305 (CHEMBL617090)
Ki 12.7±n/a nM
Citation Fu, XTan, PZKula, NSBaldessarini, RTamagnan, GInnis, RBBaldwin, RM Synthesis, receptor potency, and selectivity of halogenated diphenylpiperidines as serotonin 5-HT2A ligands for PET or SPECT brain imaging. J Med Chem45:2319-24 (2002) 5-hydroxytryptamine receptor 2A
Name:5-hydroxytryptamine receptor 2A
Type:undefined
Mol. Mass.:52607.65
Organism:Homo sapiens (Human)
Description:P28223
Residue:471
BDBM50113328
NameBDBM50113328
Synonyms:(4-Fluoro-phenyl)-[1-(3-iodo-benzyl)-piperidin-4-yl]-methanone | CHEMBL74887
TypeSmall organic molecule
Emp. Form.C19H19FINO
Mol. Mass.423.2631
SMILESFc1ccc(cc1)C(=O)C1CCN(Cc2cccc(I)c2)CC1