Reaction Details
Target5-hydroxytryptamine receptor 2A
LigandBDBM50095027
Substrate/Competitorn/a
Meas. Tech.ChEMBL_2288 (CHEMBL617073)
Ki 0.36±n/a nM
Citation Fu, XTan, PZKula, NSBaldessarini, RTamagnan, GInnis, RBBaldwin, RM Synthesis, receptor potency, and selectivity of halogenated diphenylpiperidines as serotonin 5-HT2A ligands for PET or SPECT brain imaging. J Med Chem45:2319-24 (2002) 5-hydroxytryptamine receptor 2A
Name:5-hydroxytryptamine receptor 2A
Type:undefined
Mol. Mass.:52607.65
Organism:Homo sapiens (Human)
Description:P28223
Residue:471
BDBM50095027
NameBDBM50095027
Synonyms:(2,3-Dimethoxy-phenyl)-{1-[2-(4-fluoro-phenyl)-ethyl]-piperidin-4-yl}-methanol (2,3-Dimethoxy-phenyl)-{1-[2-(4-fluoro-phenyl)-ethyl]-piperidin-4-yl}-methanol(MDL 100907) (R)-(2,3-Dimethoxy-phenyl)-{1-[2-(4-fluoro-phenyl)-ethyl]-piperidin-4-yl}-methanol (R)-(2,3-dimethoxyphenyl)(1-(4-fluorophenethyl)piperidin-4-yl)methanol MDL 100907 | MDL-100907
TypeSmall organic molecule
Emp. Form.C22H28FNO3
Mol. Mass.373.461
SMILESCOc1cccc([C@H](O)C2CCN(CCc3ccc(F)cc3)CC2)c1OC