Reaction Details
Target5-hydroxytryptamine receptor 2A
LigandBDBM50113333
Substrate/Competitorn/a
Meas. Tech.ChEMBL_2305 (CHEMBL617090)
Ki 1.15±n/a nM
Citation Fu, XTan, PZKula, NSBaldessarini, RTamagnan, GInnis, RBBaldwin, RM Synthesis, receptor potency, and selectivity of halogenated diphenylpiperidines as serotonin 5-HT2A ligands for PET or SPECT brain imaging. J Med Chem45:2319-24 (2002) 5-hydroxytryptamine receptor 2A
Name:5-hydroxytryptamine receptor 2A
Type:undefined
Mol. Mass.:52607.65
Organism:Homo sapiens (Human)
Description:P28223
Residue:471
BDBM50113333
NameBDBM50113333
Synonyms:(4-Nitro-phenyl)-(1-phenethyl-piperidin-4-yl)-methanol | CHEMBL74317
TypeSmall organic molecule
Emp. Form.C20H24N2O3
Mol. Mass.340.4162
SMILESOC(C1CCN(CCc2ccccc2)CC1)c1ccc(cc1)[N+]([O-])=O