Reaction Details
Target5-hydroxytryptamine receptor 2A
LigandBDBM50113324
Substrate/Competitorn/a
Meas. Tech.ChEMBL_2305 (CHEMBL617090)
Ki 3.62±n/a nM
Citation Fu, XTan, PZKula, NSBaldessarini, RTamagnan, GInnis, RBBaldwin, RM Synthesis, receptor potency, and selectivity of halogenated diphenylpiperidines as serotonin 5-HT2A ligands for PET or SPECT brain imaging. J Med Chem45:2319-24 (2002) 5-hydroxytryptamine receptor 2A
Name:5-hydroxytryptamine receptor 2A
Type:undefined
Mol. Mass.:52607.65
Organism:Homo sapiens (Human)
Description:P28223
Residue:471
BDBM50113324
NameBDBM50113324
Synonyms:(4-Fluoro-phenyl)-{1-[2-(4-iodo-phenyl)-ethyl]-piperidin-4-yl}-methanone | CHEMBL73979
TypeSmall organic molecule
Emp. Form.C20H21FINO
Mol. Mass.437.2897
SMILESFc1ccc(cc1)C(=O)C1CCN(CCc2ccc(I)cc2)CC1