Reaction Details
TargetIntegrin alpha-4/beta-7
LigandBDBM50113546
Substrate/Competitorn/a
Meas. Tech.ChEMBL_217615 (CHEMBL820358)
IC50 7.1±n/a nM
Citation Doherty, GAYang, GXBorges, EChang, LLMacCoss, MTong, SKidambi, UEgger, LAMcCauley, EVan Riper, GMumford, RASchmidt, JAHagmann, WK Substituted tetrahydrofuroyl-1-phenylalanine derivatives as potent and specific VLA-4 antagonists. Bioorg Med Chem Lett12:1501-5 (2002) Integrin alpha-4/beta-7
Name:Integrin alpha-4/beta-7
Type:Protein Complex
Mol. Mass.:n/a
Description:The assay uses stably transfected K562 cells expressing human alpha4beta7 integrin.
Components:This complex has 2 components.
Component 1
Name:Integrin alpha-4
Synonyms:CD49 antigen-like family member D CD49d antigen ITA4_HUMAN Integrin alpha-4 Integrin alpha-IV VLA-4 integrin alpha 4 precursor | integrin alpha-4 precursor
Type:Membrane Protein
Mol. Mass.:114897.35
Organism:Homo sapiens (Human)
Description:P13612
Residue:1032
Component 2
Name:Integrin beta-7
Synonyms:ITB7_HUMAN Integrin alpha-4/beta-7 Integrin beta7
Type:Membrane Protein
Mol. Mass.:86893.88
Organism:Homo sapiens (Human)
Description:P26010
Residue:798
BDBM50113546
NameBDBM50113546
Synonyms:(S)-3-(2',6'-Dimethoxy-biphenyl-4-yl)-2-[((R)-2-methyl-tetrahydro-furan-2-carbonyl)-amino]-propionic acid | CHEMBL34498
TypeSmall organic molecule
Emp. Form.C23H27NO6
Mol. Mass.413.4636
SMILESCOc1cccc(OC)c1-c1ccc(C[C@H](NC(=O)[C@@]2(C)CCCO2)C(O)=O)cc1