Reaction Details
TargetIntegrin alpha-4/beta-1
LigandBDBM50113554
Substrate/Competitorn/a
Meas. Tech.ChEMBL_213397 (CHEMBL818055)
IC50 0.230000±n/a nM
Citation Doherty, GAYang, GXBorges, EChang, LLMacCoss, MTong, SKidambi, UEgger, LAMcCauley, EVan Riper, GMumford, RASchmidt, JAHagmann, WK Substituted tetrahydrofuroyl-1-phenylalanine derivatives as potent and specific VLA-4 antagonists. Bioorg Med Chem Lett12:1501-5 (2002) Integrin alpha-4/beta-1
Name:Integrin alpha-4/beta-1
Type:n/a
Mol. Mass.:n/a
Description:ASSAY_ID of EBI is 88912
Components:This complex has 2 components.
Component 1
Name:Integrin beta-1
Synonyms:CD_antigen=CD29 Fibronectin receptor beta GPIIA ITGB1 MDF2 | MSK12
Type:Enzyme
Mol. Mass.:88400.38
Organism:Homo sapiens (Human)
Description:P05556
Residue:798
Component 2
Name:Integrin alpha-4
Synonyms:CD49 antigen-like family member D CD49d antigen ITA4_HUMAN Integrin alpha-4 Integrin alpha-IV VLA-4 integrin alpha 4 precursor | integrin alpha-4 precursor
Type:Membrane Protein
Mol. Mass.:114897.35
Organism:Homo sapiens (Human)
Description:P13612
Residue:1032
BDBM50113554
NameBDBM50113554
Synonyms:(S)-3-(2',6'-Dimethoxy-biphenyl-4-yl)-2-{[(S)-2-(3-nitro-phenyl)-tetrahydro-furan-2-carbonyl]-amino}-propionic acid | CHEMBL38091
TypeSmall organic molecule
Emp. Form.C28H28N2O8
Mol. Mass.520.5305
SMILESCOc1cccc(OC)c1-c1ccc(C[C@H](NC(=O)[C@]2(CCCO2)c2cccc(c2)[N+]([O-])=O)C(O)=O)cc1