Reaction Details
TargetC-X-C chemokine receptor type 1/2
LigandBDBM50219797
Substrate/Competitorn/a
Meas. Tech.ChEMBL_88519 (CHEMBL699616)
IC50 46±n/a nM
Citation Cutshall, NSKucera, KAUrsino, RLatham, JIhle, NC Nicotinanilides as inhibitors of neutrophil chemotaxis. Bioorg Med Chem Lett12:1517-20 (2002) C-X-C chemokine receptor type 1/2
Name:C-X-C chemokine receptor type 1/2
Synonyms:Interleukin-8 receptors, CXCR1/CXCR2
Type:n/a
Mol. Mass.:n/a
Description:ASSAY_ID of ChEMBL is 89096
Components:This complex has 2 components.
Component 1
Name:C-X-C chemokine receptor type 1
Type:Enzyme
Mol. Mass.:39803.83
Organism:Homo sapiens (Human)
Description:P25024
Residue:350
Component 2
Name:C-X-C chemokine receptor type 2
Synonyms:C-X-C chemokine receptor type 2 (CXCR-2) CD_antigen=CD182 CXCR-2 CXCR2_HUMAN GRO/MGSA receptor IL-8 receptor type 2 IL8RB | Interleukin-8 receptor B
Type:Protein
Mol. Mass.:40767.88
Organism:Homo sapiens (Human)
Description:P25025
Residue:360
BDBM50219797
NameBDBM50219797
Synonyms:CHEMBL36934
TypeSmall organic molecule
Emp. Form.C17H17FN2O3S
Mol. Mass.348.392
SMILESCCCOC(=O)CSc1ccc(cn1)C(=O)Nc1ccc(F)cc1