Reaction Details
TargetMitogen-activated protein kinase 6
LigandBDBM50306682
Substrate/Competitorn/a
Meas. Tech.ChEMBL_2047482 (CHEMBL4702181)
Kd 3400±n/a nM
Citation Grädler, UBusch, MLeuthner, BRaba, MBurgdorf, LLehmann, MLinde, NEsdar, C Biochemical, cellular and structural characterization of novel and selective ERK3 inhibitors. Bioorg Med Chem Lett30:0 (2020) 
 
Mitogen-activated protein kinase 6
Name:Mitogen-activated protein kinase 6
Type:PROTEIN
Mol. Mass.:82643.07
Organism:Homo sapiens (Human)
Description:ChEMBL_774367
Residue:721
BDBM50306682
NameBDBM50306682
Synonyms:(R)-3-(1-(2,6-dichloro-3-fluorophenyl)ethoxy)-5-(1-(piperidin-4-yl)-1H-pyrazol-4-yl)pyridin-2-amine 3-[(1R)-1-(2,6-dichloro-3-fluorophenyl)ethoxy]-5-(1-piperidin-4-yl-1H-pyrazol-4-yl)pyridin-2-amine CRIZOTINIB US10370379, Crizotinib US10780082, Compound Crizotinib US11517561, Compound Crizotinib US9199944, Crizotinib | US9226923, Crizotinib
TypeSmall organic molecule
Emp. Form.C21H22Cl2FN5O
Mol. Mass.450.337
SMILESC[C@@H](Oc1cc(cnc1N)-c1cnn(c1)C1CCNCC1)c1c(Cl)ccc(F)c1Cl