Reaction Details
TargetCannabinoid receptor 1
LigandBDBM50114680
Substrate/Competitorn/a
Meas. Tech.ChEMBL_46636 (CHEMBL658892)
Ki 154±n/a nM
Citation Francisco, MESeltzman, HHGilliam, AFMitchell, RARider, SLPertwee, RGStevenson, LAThomas, BF Synthesis and structure-activity relationships of amide and hydrazide analogues of the cannabinoid CB(1) receptor antagonist N-(piperidinyl)- 5-(4-chlorophenyl)-1-(2,4-dichlorophenyl)-4-methyl-1H-pyrazole-3-carboxamide (SR141716). J Med Chem45:2708-19 (2002) Cannabinoid receptor 1
Name:Cannabinoid receptor 1
Type:G Protein-Coupled Receptor (GPCR)
Mol. Mass.:52856.55
Organism:Rattus norvegicus (rat)
Description:P20272
Residue:473
BDBM50114680
NameBDBM50114680
Synonyms:5-(4-Chloro-phenyl)-1-(2,4-dichloro-phenyl)-4-methyl-1H-pyrazole-3-carboxylic acid (4-hydroxy-butyl)-amide | CHEMBL90040
TypeSmall organic molecule
Emp. Form.C21H20Cl3N3O2
Mol. Mass.452.761
SMILESCc1c(nn(c1-c1ccc(Cl)cc1)-c1ccc(Cl)cc1Cl)C(=O)NCCCCO