Reaction Details
TargetMAP kinase-interacting serine/threonine-protein kinase 2
LigandBDBM50187658
Substrate/Competitorn/a
Meas. Tech.ChEMBL_2048625 (CHEMBL4703324)
IC50 979±n/a nM
Citation Chen, LCHuang, HLHuangFu, WCYen, SCNgo, STWu, YWLin, TESung, TYLien, STTseng, HJPan, SLHuang, WJHsu, KC Biological Evaluation of Selected Flavonoids as Inhibitors of MNKs Targeting Acute Myeloid Leukemia. J Nat Prod83:2967-2975 (2020) 
 
MAP kinase-interacting serine/threonine-protein kinase 2
Name:MAP kinase-interacting serine/threonine-protein kinase 2
Type:Protein
Mol. Mass.:51870.79
Organism:Homo sapiens (Human)
Description:Q9HBH9
Residue:465
BDBM50187658
NameBDBM50187658
Synonyms:4',5-dihydroxy-7-methoxy flavone 5-hydroxy-2-(4-hydroxyphenyl)-7-methoxy-4H-chromen-4-one CHEMBL210635 genkwanin
TypeSmall organic molecule
Emp. Form.C16H12O5
Mol. Mass.284.2635
SMILESCOc1cc(O)c2c(c1)oc(cc2=O)-c1ccc(O)cc1