Reaction Details
TargetEndothelin-converting enzyme 1
LigandBDBM50114914
Substrate/Competitorn/a
Meas. Tech.ChEBML_64361
IC50 720±n/a nM
Citation Kitas, EALöffler, BMDaetwyler, SDehmlow, HAebi, JD Synthesis of triazole-Tethered pyrrolidine libraries: novel ECE inhibitors. Bioorg Med Chem Lett12:1727-30 (2002) Endothelin-converting enzyme 1
Name:Endothelin-converting enzyme 1
Type:Enzyme
Mol. Mass.:87155.11
Organism:Homo sapiens (Human)
Description:P42892
Residue:770
BDBM50114914
NameBDBM50114914
Synonyms:(3R,5S)-5-(5-Isobutylsulfanyl-4-phenyl-4H-[1,2,4]triazol-3-yl)-1-(naphthalene-2-sulfonyl)-pyrrolidine-3-thiol | CHEMBL295865
TypeSmall organic molecule
Emp. Form.C26H28N4O2S3
Mol. Mass.524.721
SMILESCC(C)CSc1nnc([C@@H]2C[C@@H](S)CN2S(=O)(=O)c2ccc3ccccc3c2)n1-c1ccccc1