Reaction Details
TargetEndothelin-converting enzyme 1
LigandBDBM50114916
Substrate/Competitorn/a
Meas. Tech.ChEBML_64361
IC50 1200±n/a nM
Citation Kitas, EALöffler, BMDaetwyler, SDehmlow, HAebi, JD Synthesis of triazole-Tethered pyrrolidine libraries: novel ECE inhibitors. Bioorg Med Chem Lett12:1727-30 (2002) Endothelin-converting enzyme 1
Name:Endothelin-converting enzyme 1
Type:Enzyme
Mol. Mass.:87155.11
Organism:Homo sapiens (Human)
Description:P42892
Residue:770
BDBM50114916
NameBDBM50114916
Synonyms:(3R,5S)-5-[4-(3-Chloro-4-fluoro-phenyl)-5-methylsulfanyl-4H-[1,2,4]triazol-3-yl]-1-(naphthalene-2-sulfonyl)-pyrrolidine-3-thiol | CHEMBL300855
TypeSmall organic molecule
Emp. Form.C23H20ClFN4O2S3
Mol. Mass.535.077
SMILESCSc1nnc([C@@H]2C[C@@H](S)CN2S(=O)(=O)c2ccc3ccccc3c2)n1-c1ccc(F)c(Cl)c1