Reaction Details
TargetSubstance-P receptor
LigandBDBM50114939
Substrate/Competitorn/a
Meas. Tech.ChEBML_205739
IC50 0.440000±n/a nM
Citation Elliott, JMCastro, JLChicchi, GGCooper, LCDinnell, KHollingworth, GJRidgill, MPRycroft, WKurtz, MMShaw, DESwain, CJTsao, KLYang, L 4,4-Disubstituted cyclohexylamine NK(1) receptor antagonists I. Bioorg Med Chem Lett12:1755-8 (2002) Substance-P receptor
Name:Substance-P receptor
Type:G Protein-Coupled Receptor (GPCR)
Mol. Mass.:46254.43
Organism:Homo sapiens (Human)
Description:P25103
Residue:407
BDBM50114939
NameBDBM50114939
Synonyms:2-(3,5-Bis-trifluoromethyl-phenyl)-N-{4-[4-(4-fluoro-phenyl)-piperidin-1-yl]-1-phenyl-cyclohexyl}-3-hydroxy-propionamide | CHEMBL50867
TypeSmall organic molecule
Emp. Form.C34H35F7N2O2
Mol. Mass.636.6427
SMILESOCC(C(=O)N[C@]1(CC[C@@H](CC1)N1CCC(CC1)c1ccc(F)cc1)c1ccccc1)c1cc(cc(c1)C(F)(F)F)C(F)(F)F