Reaction Details
TargetSubstance-P receptor
LigandBDBM50114944
Substrate/Competitorn/a
Meas. Tech.ChEBML_205739
IC50 0.290000±n/a nM
Citation Elliott, JMCastro, JLChicchi, GGCooper, LCDinnell, KHollingworth, GJRidgill, MPRycroft, WKurtz, MMShaw, DESwain, CJTsao, KLYang, L 4,4-Disubstituted cyclohexylamine NK(1) receptor antagonists I. Bioorg Med Chem Lett12:1755-8 (2002) Substance-P receptor
Name:Substance-P receptor
Type:G Protein-Coupled Receptor (GPCR)
Mol. Mass.:46254.43
Organism:Homo sapiens (Human)
Description:P25103
Residue:407
BDBM50114944
NameBDBM50114944
Synonyms:4-[4-(4-Fluoro-phenyl)-piperidin-1-yl]-1-phenyl-cyclohexanecarboxylic acid [1-(3,5-bis-trifluoromethyl-phenyl)-2-hydroxy-ethyl]-amide | CHEMBL296583
TypeSmall organic molecule
Emp. Form.C34H35F7N2O2
Mol. Mass.636.6427
SMILESOCC(NC(=O)[C@]1(CC[C@@H](CC1)N1CCC(CC1)c1ccc(F)cc1)c1ccccc1)c1cc(cc(c1)C(F)(F)F)C(F)(F)F